Reaction Details
TargetCannabinoid receptor 1
LigandBDBM50424490
Substrate/Competitorn/a
Meas. Tech.ChEMBL_937027 (CHEMBL2317166)
EC50 8.1±n/a nM
Citation Plowright, ATNilsson, KAntonsson, MAmin, KBroddefalk, JJensen, JLehmann, AJin, SSt-Onge, STomaszewski, MJTremblay, MWalpole, CWei, ZYang, HUlander, J Discovery of agonists of cannabinoid receptor 1 with restricted central nervous system penetration aimed for treatment of gastroesophageal reflux disease. J Med Chem56:220-40 (2013) 
 
Cannabinoid receptor 1
Name:Cannabinoid receptor 1
Type:G Protein-Coupled Receptor (GPCR)
Mol. Mass.:52868.96
Organism:Homo sapiens (Human)
Description:P21554
Residue:472
BDBM50424490
NameBDBM50424490
Synonyms:CHEMBL2316380
TypeSmall organic molecule
Emp. Form.C24H23N7O2
Mol. Mass.441.4851
SMILESO=C(NCC1CCC1)c1nccnc1NC(=O)c1ccc(Cn2ccnn2)c2ccccc12