Reaction Details
TargetGlucose-dependent insulinotropic receptor
LigandBDBM50424567
Substrate/Competitorn/a
Meas. Tech.ChEMBL_933672 (CHEMBL2320533)
Ki 1496±n/a nM
Citation Darout, ERobinson, RPMcClure, KFCorbett, MLi, BShavnya, AAndrews, MPJones, CSLi, QMinich, MLMascitti, VGuimarães, CRMunchhof, MJBahnck, KBCai, CPrice, DALiras, SBonin, PDCornelius, PWang, RBagdasarian, VSobota, CPHornby, SMasterson, VMJoseph, RMKalgutkar, ASChen, Y Design and synthesis of diazatricyclodecane agonists of the G-protein-coupled receptor 119. J Med Chem56:301-19 (2013) 
 
Glucose-dependent insulinotropic receptor
Name:Glucose-dependent insulinotropic receptor
Type:Protein
Mol. Mass.:36901.49
Organism:Homo sapiens (Human)
Description:Q8TDV5
Residue:335
BDBM50424567
NameBDBM50424567
Synonyms:CHEMBL2312509
TypeSmall organic molecule
Emp. Form.C23H29N5O4
Mol. Mass.439.5075
SMILESCOc1c(Oc2cccnc2C)ncnc1N1C2CC3CC1CC(C2)N3C(=O)OC(C)C