Reaction Details
TargetGlucose-dependent insulinotropic receptor
LigandBDBM50424557
Substrate/Competitorn/a
Meas. Tech.ChEMBL_933672 (CHEMBL2320533)
Ki 682±n/a nM
Citation Darout, ERobinson, RPMcClure, KFCorbett, MLi, BShavnya, AAndrews, MPJones, CSLi, QMinich, MLMascitti, VGuimarães, CRMunchhof, MJBahnck, KBCai, CPrice, DALiras, SBonin, PDCornelius, PWang, RBagdasarian, VSobota, CPHornby, SMasterson, VMJoseph, RMKalgutkar, ASChen, Y Design and synthesis of diazatricyclodecane agonists of the G-protein-coupled receptor 119. J Med Chem56:301-19 (2013) 
 
Glucose-dependent insulinotropic receptor
Name:Glucose-dependent insulinotropic receptor
Type:Protein
Mol. Mass.:36901.49
Organism:Homo sapiens (Human)
Description:Q8TDV5
Residue:335
BDBM50424557
NameBDBM50424557
Synonyms:CHEMBL2312523
TypeSmall organic molecule
Emp. Form.C24H29N5O3
Mol. Mass.435.5188
SMILESCc1ncccc1Oc1ncnc(N2C3CC4CC2CC(C3)N4C(=O)OC2CCC2)c1C