Reaction Details
TargetAcetolactate synthase catalytic subunit, mitochondrial
LigandBDBM50424590
Substrate/Competitorn/a
Meas. Tech.ChEMBL_934102 (CHEMBL2318855)
Ki 32±n/a nM
Citation Lee, YTCui, CJChow, EWPue, NLonhienne, TWang, JGFraser, JAGuddat, LW Sulfonylureas have antifungal activity and are potent inhibitors of Candida albicans acetohydroxyacid synthase. J Med Chem56:210-9 (2013) 
 
Acetolactate synthase catalytic subunit, mitochondrial
Name:Acetolactate synthase catalytic subunit, mitochondrial
Type:PROTEIN
Mol. Mass.:74947.98
Organism:Saccharomyces cerevisiae
Description:ChEMBL_934102
Residue:687
BDBM50424590
NameBDBM50424590
Synonyms:CHEMBL2313155 | Pyrazosulfuron Ethyl
TypeSmall organic molecule
Emp. Form.C14H18N6O7S
Mol. Mass.414.394
SMILESCCOC(=O)c1cnn(C)c1S(=O)(=O)NC(=O)Nc1nc(OC)cc(OC)n1