Reaction Details
TargetAcetolactate synthase catalytic subunit, mitochondrial
LigandBDBM50424591
Substrate/Competitorn/a
Meas. Tech.ChEMBL_934102 (CHEMBL2318855)
Ki 4.4±n/a nM
Citation Lee, YTCui, CJChow, EWPue, NLonhienne, TWang, JGFraser, JAGuddat, LW Sulfonylureas have antifungal activity and are potent inhibitors of Candida albicans acetohydroxyacid synthase. J Med Chem56:210-9 (2013) 
 
Acetolactate synthase catalytic subunit, mitochondrial
Name:Acetolactate synthase catalytic subunit, mitochondrial
Type:PROTEIN
Mol. Mass.:74947.98
Organism:Saccharomyces cerevisiae
Description:ChEMBL_934102
Residue:687
BDBM50424591
NameBDBM50424591
Synonyms:Bensulfuron Methyl | CHEMBL2313154
TypeSmall organic molecule
Emp. Form.C16H18N4O7S
Mol. Mass.410.402
SMILESCOC(=O)c1ccccc1CS(=O)(=O)NC(=O)Nc1nc(OC)cc(OC)n1