Reaction Details
TargetDual specificity tyrosine-phosphorylation-regulated kinase 3
LigandBDBM100152
Substrate/Competitorn/a
Meas. Tech.ChEMBL_934295 (CHEMBL2320041)
IC50 800±n/a nM
Citation Loidreau, YMarchand, PDubouilh-Benard, CNourrisson, MRDuflos, MLoaëc, NMeijer, LBesson, T Synthesis and biological evaluation of N-aryl-7-methoxybenzo[b]furo[3,2-d]pyrimidin-4-amines and their N-arylbenzo[b]thieno[3,2-d]pyrimidin-4-amine analogues as dual inhibitors of CLK1 and DYRK1A kinases. Eur J Med Chem59:283-95 (2013) 
 
Dual specificity tyrosine-phosphorylation-regulated kinase 3
Name:Dual specificity tyrosine-phosphorylation-regulated kinase 3
Type:PROTEIN
Mol. Mass.:65747.26
Organism:Homo sapiens (Human)
Description:ChEMBL_1508026
Residue:588
BDBM100152
NameBDBM100152
Synonyms:7-methoxy-1-methyl-9H-beta-carboline;hydrochloride HARMINE MLS002153910 cid_5359389
TypeSmall organic molecule
Emp. Form.C13H12N2O
Mol. Mass.212.2472
SMILESCOc1ccc2c(c1)[nH]c1c(C)nccc21