Reaction Details
TargetMultidrug and toxin extrusion protein 2
LigandBDBM36880
Substrate/Competitorn/a
Meas. Tech.ChEMBL_934318 (CHEMBL2320304)
IC50 6600±n/a nM
Citation Wittwer, MBZur, AAKhuri, NKido, YKosaka, AZhang, XMorrissey, KMSali, AHuang, YGiacomini, KM Discovery of potent, selective multidrug and toxin extrusion transporter 1 (MATE1, SLC47A1) inhibitors through prescription drug profiling and computational modeling. J Med Chem56:781-95 (2013) 
 
Multidrug and toxin extrusion protein 2
Name:Multidrug and toxin extrusion protein 2
Type:PROTEIN
Mol. Mass.:65098.38
Organism:Homo sapiens (Human)
Description:ChEMBL_934314
Residue:602
BDBM36880
NameBDBM36880
Synonyms:2,2'-THIOBIS(4,6-DICHLOROPHENOL) 2,4-dichloro-6-[(3,5-dichloro-2-hydroxy-phenyl)thio]phenol 2-[3,5-bis(chloranyl)-2-oxidanyl-phenyl]sulfanyl-4,6-bis(chloranyl)phenol HL-3 SMR000058374 | cid_2406
TypeSmall organic molecule
Emp. Form.C12H6Cl4O2S
Mol. Mass.356.052
SMILESOc1c(Cl)cc(Cl)cc1Sc1cc(Cl)cc(Cl)c1O