Reaction Details
TargetMultidrug and toxin extrusion protein 2
LigandBDBM50104435
Substrate/Competitorn/a
Meas. Tech.ChEMBL_934318 (CHEMBL2320304)
IC50 10800±n/a nM
Citation Wittwer, MBZur, AAKhuri, NKido, YKosaka, AZhang, XMorrissey, KMSali, AHuang, YGiacomini, KM Discovery of potent, selective multidrug and toxin extrusion transporter 1 (MATE1, SLC47A1) inhibitors through prescription drug profiling and computational modeling. J Med Chem56:781-95 (2013) 
 
Multidrug and toxin extrusion protein 2
Name:Multidrug and toxin extrusion protein 2
Type:PROTEIN
Mol. Mass.:65098.38
Organism:Homo sapiens (Human)
Description:ChEMBL_934314
Residue:602
BDBM50104435
NameBDBM50104435
Synonyms:4-(6-Guanidino-hexanoyloxy)-benzoic acid ethyl ester | CHEMBL87563
TypeSmall organic molecule
Emp. Form.C16H23N3O4
Mol. Mass.321.3715
SMILESCCOC(=O)c1ccc(OC(=O)CCCCCNC(N)=N)cc1