Reaction Details
TargetMultidrug and toxin extrusion protein 2
LigandBDBM50334986
Substrate/Competitorn/a
Meas. Tech.ChEMBL_934318 (CHEMBL2320304)
IC50 297000±n/a nM
Citation Wittwer, MBZur, AAKhuri, NKido, YKosaka, AZhang, XMorrissey, KMSali, AHuang, YGiacomini, KM Discovery of potent, selective multidrug and toxin extrusion transporter 1 (MATE1, SLC47A1) inhibitors through prescription drug profiling and computational modeling. J Med Chem56:781-95 (2013) 
 
Multidrug and toxin extrusion protein 2
Name:Multidrug and toxin extrusion protein 2
Type:PROTEIN
Mol. Mass.:65098.38
Organism:Homo sapiens (Human)
Description:ChEMBL_934314
Residue:602
BDBM50334986
NameBDBM50334986
Synonyms:4,4-Difluoro-cyclohexanecarboxylic acid {(S)-3-[(1S,5S)-3-(3-isopropyl-5-methyl-[1,2,4]triazol-4-yl)-8-aza-bicyclo[3.2.1]oct-8-yl]-1-phenyl-propyl}-amide 4,4-difluoro-N-((S)-3-((1S,3S,5R)-3-(3-isopropyl-5-methyl-4H-1,2,4-triazol-4-yl)-8-aza-bicyclo[3.2.1]octan-8-yl)-1-phenylpropyl)cyclohexanecarboxamide CHEMBL1201187 Selzentry | UK-427857
TypeSmall organic molecule
Emp. Form.C29H41F2N5O
Mol. Mass.513.6655
SMILESCC(C)c1nnc(C)n1[C@H]1C[C@@H]2CC[C@H](C1)N2CC[C@H](NC(=O)C1CCC(F)(F)CC1)c1ccccc1