Reaction Details
TargetMultidrug and toxin extrusion protein 1
LigandBDBM50241342
Substrate/Competitorn/a
Meas. Tech.ChEMBL_934320 (CHEMBL2320306)
IC50 43200±n/a nM
Citation Wittwer, MBZur, AAKhuri, NKido, YKosaka, AZhang, XMorrissey, KMSali, AHuang, YGiacomini, KM Discovery of potent, selective multidrug and toxin extrusion transporter 1 (MATE1, SLC47A1) inhibitors through prescription drug profiling and computational modeling. J Med Chem56:781-95 (2013) 
 
Multidrug and toxin extrusion protein 1
Name:Multidrug and toxin extrusion protein 1
Type:PROTEIN
Mol. Mass.:61928.01
Organism:Homo sapiens (Human)
Description:ChEMBL_934313
Residue:570
BDBM50241342
NameBDBM50241342
Synonyms:5-(difluoromethoxy)-2-((3,4-dimethoxypyridin-2-yl)methylsulfinyl)-1H-benzo[d]imidazole 6-(difluoromethoxy)-2-((3,4-dimethoxypyridin-2-yl)methylsulfinyl)-1H-benzo[d]imidazole CHEMBL1502 Protonix SK-96022
TypeSmall organic molecule
Emp. Form.C16H15F2N3O4S
Mol. Mass.383.37
SMILESCOc1ccnc(CS(=O)c2nc3ccc(OC(F)F)cc3[nH]2)c1OC