Reaction Details
TargetMultidrug and toxin extrusion protein 1
LigandBDBM50366799
Substrate/Competitorn/a
Meas. Tech.ChEMBL_934320 (CHEMBL2320306)
IC50 9400±n/a nM
Citation Wittwer, MBZur, AAKhuri, NKido, YKosaka, AZhang, XMorrissey, KMSali, AHuang, YGiacomini, KM Discovery of potent, selective multidrug and toxin extrusion transporter 1 (MATE1, SLC47A1) inhibitors through prescription drug profiling and computational modeling. J Med Chem56:781-95 (2013) 
 
Multidrug and toxin extrusion protein 1
Name:Multidrug and toxin extrusion protein 1
Type:PROTEIN
Mol. Mass.:61928.01
Organism:Homo sapiens (Human)
Description:ChEMBL_934313
Residue:570
BDBM50366799
NameBDBM50366799
Synonyms:TUBOCURARINE | TUBOCURARINE CHLORIDE
TypeSmall organic molecule
Emp. Form.C37H41N2O6
Mol. Mass.609.7307
SMILESCOc1cc2CC[N+](C)(C)[C@@H]3Cc4ccc(O)c(Oc5cc6[C@H](Cc7ccc(Oc(c1O)c23)cc7)N(C)CCc6cc5OC)c4