Reaction Details
TargetMultidrug and toxin extrusion protein 2
LigandBDBM85330
Substrate/Competitorn/a
Meas. Tech.ChEMBL_934314 (CHEMBL2320300)
IC50 160±n/a nM
Citation Wittwer, MBZur, AAKhuri, NKido, YKosaka, AZhang, XMorrissey, KMSali, AHuang, YGiacomini, KM Discovery of potent, selective multidrug and toxin extrusion transporter 1 (MATE1, SLC47A1) inhibitors through prescription drug profiling and computational modeling. J Med Chem56:781-95 (2013) 
 
Multidrug and toxin extrusion protein 2
Name:Multidrug and toxin extrusion protein 2
Type:PROTEIN
Mol. Mass.:65098.38
Organism:Homo sapiens (Human)
Description:ChEMBL_934314
Residue:602
BDBM85330
NameBDBM85330
Synonyms:CAS_68647 ONDANSETRON | Ondansetron hydrochloride
TypeSmall organic molecule
Emp. Form.C18H19N3O
Mol. Mass.293.363
SMILESCc1nccn1CC1CCc2c(C1=O)c1ccccc1n2C