Reaction Details
TargetSolute carrier family 22 member 3
LigandBDBM50036754
Substrate/Competitorn/a
Meas. Tech.ChEMBL_934315 (CHEMBL2320301)
IC50 10700±n/a nM
Citation Wittwer, MBZur, AAKhuri, NKido, YKosaka, AZhang, XMorrissey, KMSali, AHuang, YGiacomini, KM Discovery of potent, selective multidrug and toxin extrusion transporter 1 (MATE1, SLC47A1) inhibitors through prescription drug profiling and computational modeling. J Med Chem56:781-95 (2013) 
 
Solute carrier family 22 member 3
Name:Solute carrier family 22 member 3
Type:PROTEIN
Mol. Mass.:61292.57
Organism:Homo sapiens (Human)
Description:ChEMBL_934315
Residue:556
BDBM50036754
NameBDBM50036754
Synonyms:(1Z)-N'-(aminosulfonyl)-3-[({2-[(diaminomethylene)amino]-1,3-thiazol-4-yl}methyl)thio]propanimidamide 3-(2-Guanidino-thiazol-4-ylmethylsulfanyl)-N-sulfonylamino-propionamidine FAMOTIDINE MK-208 N-sulfomoyl-3-(2-Guanidino-2H-1lambda*4*-thiazol-4-ylmethylsulfanyl)-propionamidine Pepcid ac Pepcid rpd
TypeSmall organic molecule
Emp. Form.C8H15N7O2S3
Mol. Mass.337.445
SMILES[#7]\[#6](-[#7])=[#7]/c1nc(-[#6]-[#16]-[#6]-[#6]-[#6](=[#7])-[#7]S([#7])(=O)=O)cs1