Reaction Details
TargetSolute carrier family 22 member 3
LigandBDBM520
Substrate/Competitorn/a
Meas. Tech.ChEMBL_934315 (CHEMBL2320301)
IC50>300000±n/a nM
Citation Wittwer, MBZur, AAKhuri, NKido, YKosaka, AZhang, XMorrissey, KMSali, AHuang, YGiacomini, KM Discovery of potent, selective multidrug and toxin extrusion transporter 1 (MATE1, SLC47A1) inhibitors through prescription drug profiling and computational modeling. J Med Chem56:781-95 (2013) 
 
Solute carrier family 22 member 3
Name:Solute carrier family 22 member 3
Type:PROTEIN
Mol. Mass.:61292.57
Organism:Homo sapiens (Human)
Description:ChEMBL_934315
Residue:556
BDBM520
NameBDBM520
Synonyms:1,3-thiazol-5-ylmethyl N-[(2S,3S,5S)-3-hydroxy-5-[(2S)-3-methyl-2-{[methyl({[2-(propan-2-yl)-1,3-thiazol-4-yl]methyl})carbamoyl]amino}butanamido]-1,6-diphenylhexan-2-yl]carbamate CHEMBL163 RTV | Ritonavir
TypeSmall organic molecule
Emp. Form.C37H48N6O5S2
Mol. Mass.720.944
SMILESCC(C)[C@H](NC(=O)N(C)Cc1csc(n1)C(C)C)C(=O)N[C@H](C[C@H](O)[C@H](Cc1ccccc1)NC(=O)OCc1cncs1)Cc1ccccc1