Reaction Details
TargetSolute carrier family 22 member 3
LigandBDBM36880
Substrate/Competitorn/a
Meas. Tech.ChEMBL_934315 (CHEMBL2320301)
IC50 5500±n/a nM
Citation Wittwer, MBZur, AAKhuri, NKido, YKosaka, AZhang, XMorrissey, KMSali, AHuang, YGiacomini, KM Discovery of potent, selective multidrug and toxin extrusion transporter 1 (MATE1, SLC47A1) inhibitors through prescription drug profiling and computational modeling. J Med Chem56:781-95 (2013) 
 
Solute carrier family 22 member 3
Name:Solute carrier family 22 member 3
Type:PROTEIN
Mol. Mass.:61292.57
Organism:Homo sapiens (Human)
Description:ChEMBL_934315
Residue:556
BDBM36880
NameBDBM36880
Synonyms:2,2'-THIOBIS(4,6-DICHLOROPHENOL) 2,4-dichloro-6-[(3,5-dichloro-2-hydroxy-phenyl)thio]phenol 2-[3,5-bis(chloranyl)-2-oxidanyl-phenyl]sulfanyl-4,6-bis(chloranyl)phenol HL-3 SMR000058374 | cid_2406
TypeSmall organic molecule
Emp. Form.C12H6Cl4O2S
Mol. Mass.356.052
SMILESOc1c(Cl)cc(Cl)cc1Sc1cc(Cl)cc(Cl)c1O