Reaction Details
TargetSolute carrier family 22 member 2
LigandBDBM50241342
Substrate/Competitorn/a
Meas. Tech.ChEMBL_934317 (CHEMBL2320303)
IC50 1500±n/a nM
Citation Wittwer, MBZur, AAKhuri, NKido, YKosaka, AZhang, XMorrissey, KMSali, AHuang, YGiacomini, KM Discovery of potent, selective multidrug and toxin extrusion transporter 1 (MATE1, SLC47A1) inhibitors through prescription drug profiling and computational modeling. J Med Chem56:781-95 (2013) 
 
Solute carrier family 22 member 2
Name:Solute carrier family 22 member 2
Type:PROTEIN
Mol. Mass.:62591.01
Organism:Homo sapiens (Human)
Description:ChEMBL_1484077
Residue:555
BDBM50241342
NameBDBM50241342
Synonyms:5-(difluoromethoxy)-2-((3,4-dimethoxypyridin-2-yl)methylsulfinyl)-1H-benzo[d]imidazole 6-(difluoromethoxy)-2-((3,4-dimethoxypyridin-2-yl)methylsulfinyl)-1H-benzo[d]imidazole CHEMBL1502 Protonix SK-96022
TypeSmall organic molecule
Emp. Form.C16H15F2N3O4S
Mol. Mass.383.37
SMILESCOc1ccnc(CS(=O)c2nc3ccc(OC(F)F)cc3[nH]2)c1OC