Reaction Details
TargetMultidrug and toxin extrusion protein 1
LigandBDBM50151866
Substrate/Competitorn/a
Meas. Tech.ChEMBL_934313 (CHEMBL2320299)
IC50 1100±n/a nM
Citation Wittwer, MBZur, AAKhuri, NKido, YKosaka, AZhang, XMorrissey, KMSali, AHuang, YGiacomini, KM Discovery of potent, selective multidrug and toxin extrusion transporter 1 (MATE1, SLC47A1) inhibitors through prescription drug profiling and computational modeling. J Med Chem56:781-95 (2013) 
 
Multidrug and toxin extrusion protein 1
Name:Multidrug and toxin extrusion protein 1
Type:PROTEIN
Mol. Mass.:61928.01
Organism:Homo sapiens (Human)
Description:ChEMBL_934313
Residue:570
BDBM50151866
NameBDBM50151866
Synonyms:6-(2-{(2-Hydroxy-ethyl)-[3-(4-nitro-phenyl)-propyl]-amino}-ethylamino)-1,3-dimethyl-1H-pyrimidine-2,4-dione Nifekalant
TypeSmall organic molecule
Emp. Form.C19H27N5O5
Mol. Mass.405.4482
SMILESCn1c(NCCN(CCO)CCCc2ccc(cc2)[N+]([O-])=O)cc(=O)n(C)c1=O