Reaction Details
TargetInduced myeloid leukemia cell differentiation protein Mcl-1
LigandBDBM50424734
Substrate/Competitorn/a
Meas. Tech.ChEMBL_934321 (CHEMBL2320307)
Ki 330±n/a nM
Citation Friberg, AVigil, DZhao, BDaniels, RNBurke, JPGarcia-Barrantes, PMCamper, DChauder, BALee, TOlejniczak, ETFesik, SW Discovery of potent myeloid cell leukemia 1 (Mcl-1) inhibitors using fragment-based methods and structure-based design. J Med Chem56:15-30 (2013) 
 
Induced myeloid leukemia cell differentiation protein Mcl-1
Name:Induced myeloid leukemia cell differentiation protein Mcl-1
Type:Membrane; Single-pass membrane protein
Mol. Mass.:37332.87
Organism:Homo sapiens (Human)
Description:Q07820
Residue:350
BDBM50424734
NameBDBM50424734
Synonyms:CHEMBL2314198
TypeSmall organic molecule
Emp. Form.C22H19NO3
Mol. Mass.345.3912
SMILESOC(=O)c1[nH]c2ccccc2c1CCCOc1cccc2ccccc12