Reaction Details
TargetTransitional endoplasmic reticulum ATPase
LigandBDBM50424920
Substrate/Competitorn/a
Meas. Tech.ChEMBL_934533 (CHEMBL2317274)
IC50 58±n/a nM
Citation Angiolini, MAsa, DAvanzi, NBadari, ABertrand, JCasale, ECirla, ACozzi, LCauteruccio, SDonati, DGalvani, AIsacchi, AJackson, PKLiu, YMagnaghi, PMagnuson, SMalgesini, BNuvoloni, SOrrenius, CPolucci, PRiceputi, LTrucchi, BO Brien, TRizzi, SSirtori, FRD Alessio, R Alkylsulfanyl-1,2,4-triazoles, a new class of allosteric valosine containing protein inhibitors. Synthesis and structure-activity relationships. J Med Chem56:437-50 (2013) 
 
Transitional endoplasmic reticulum ATPase
Name:Transitional endoplasmic reticulum ATPase
Type:Enzyme
Mol. Mass.:89300.63
Organism:Homo sapiens (Human)
Description:P55072
Residue:806
BDBM50424920
NameBDBM50424920
Synonyms:CHEMBL2315421
TypeSmall organic molecule
Emp. Form.C28H29N5O3S
Mol. Mass.515.627
SMILESCONC(=O)c1ccc(cc1)-c1ccc(OCc2nnc(SC3CCCC3)n2-c2cccnc2)cc1C