Reaction Details
TargetSphingosine 1-phosphate receptor 1
LigandBDBM50424946
Substrate/Competitorn/a
Meas. Tech.ChEMBL_934542 (CHEMBL2317283)
IC50 92±n/a nM
Citation Evindar, GDeng, HBernier, SGDoyle, ELorusso, JMorgan, BAWestlin, WF Exploring amino acids derivatives as potent, selective, and direct agonists of sphingosine-1-phosphate receptor subtype-1. Bioorg Med Chem Lett23:472-5 (2012) 
 
Sphingosine 1-phosphate receptor 1
Name:Sphingosine 1-phosphate receptor 1
Type:Enzyme
Mol. Mass.:42836.02
Organism:Homo sapiens (Human)
Description:P21453
Residue:382
BDBM50424946
NameBDBM50424946
Synonyms:CHEMBL2315815
TypeSmall organic molecule
Emp. Form.C19H30N2O4
Mol. Mass.350.4525
SMILESCCCCCCCCOc1ccc(NC(=O)[C@@H](N)CCC(O)=O)cc1