Reaction Details
TargetSphingosine 1-phosphate receptor 1
LigandBDBM50424951
Substrate/Competitorn/a
Meas. Tech.ChEMBL_934542 (CHEMBL2317283)
IC50 17±n/a nM
Citation Evindar, GDeng, HBernier, SGDoyle, ELorusso, JMorgan, BAWestlin, WF Exploring amino acids derivatives as potent, selective, and direct agonists of sphingosine-1-phosphate receptor subtype-1. Bioorg Med Chem Lett23:472-5 (2012) 
 
Sphingosine 1-phosphate receptor 1
Name:Sphingosine 1-phosphate receptor 1
Type:Enzyme
Mol. Mass.:42836.02
Organism:Homo sapiens (Human)
Description:P21453
Residue:382
BDBM50424951
NameBDBM50424951
Synonyms:CHEMBL2315821
TypeSmall organic molecule
Emp. Form.C26H22F3N3O3
Mol. Mass.481.4664
SMILESN[C@@H](CC(O)=O)c1nc(c[nH]1)-c1ccc(OCc2ccc(cc2)-c2ccccc2)c(c1)C(F)(F)F