Reaction Details
TargetSphingosine 1-phosphate receptor 3
LigandBDBM50424946
Substrate/Competitorn/a
Meas. Tech.ChEMBL_934543 (CHEMBL2317284)
IC50 10000±n/a nM
Citation Evindar, GDeng, HBernier, SGDoyle, ELorusso, JMorgan, BAWestlin, WF Exploring amino acids derivatives as potent, selective, and direct agonists of sphingosine-1-phosphate receptor subtype-1. Bioorg Med Chem Lett23:472-5 (2012) 
 
Sphingosine 1-phosphate receptor 3
Name:Sphingosine 1-phosphate receptor 3
Type:G Protein-Coupled Receptor (GPCR)
Mol. Mass.:42278.13
Organism:Homo sapiens (Human)
Description:Q99500
Residue:378
BDBM50424946
NameBDBM50424946
Synonyms:CHEMBL2315815
TypeSmall organic molecule
Emp. Form.C19H30N2O4
Mol. Mass.350.4525
SMILESCCCCCCCCOc1ccc(NC(=O)[C@@H](N)CCC(O)=O)cc1