Reaction Details
TargetHistone deacetylase 4
LigandBDBM50424997
Substrate/Competitorn/a
Meas. Tech.ChEMBL_936030 (CHEMBL2318996)
IC50 83±n/a nM
Citation Marek, LHamacher, AHansen, FKKuna, KGohlke, HKassack, MUKurz, T Histone deacetylase (HDAC) inhibitors with a novel connecting unit linker region reveal a selectivity profile for HDAC4 and HDAC5 with improved activity against chemoresistant cancer cells. J Med Chem56:427-36 (2013) 
 
Histone deacetylase 4
Name:Histone deacetylase 4
Type:Enzyme
Mol. Mass.:119049.39
Organism:Homo sapiens (Human)
Description:P56524
Residue:1084
BDBM50424997
NameBDBM50424997
Synonyms:CHEMBL2312167
TypeSmall organic molecule
Emp. Form.C15H22N2O4
Mol. Mass.294.3462
SMILESCc1ccc(cc1C)C(=O)NOCCCCCC(=O)NO