Reaction Details
TargetHistone deacetylase 2
LigandBDBM50424997
Substrate/Competitorn/a
Meas. Tech.ChEMBL_936031 (CHEMBL2318997)
IC50 944±n/a nM
Citation Marek, LHamacher, AHansen, FKKuna, KGohlke, HKassack, MUKurz, T Histone deacetylase (HDAC) inhibitors with a novel connecting unit linker region reveal a selectivity profile for HDAC4 and HDAC5 with improved activity against chemoresistant cancer cells. J Med Chem56:427-36 (2013) 
 
Histone deacetylase 2
Name:Histone deacetylase 2
Type:Chromatin regulator; hydrolase; repressor
Mol. Mass.:55356.54
Organism:Homo sapiens (Human)
Description:Q92769
Residue:488
BDBM50424997
NameBDBM50424997
Synonyms:CHEMBL2312167
TypeSmall organic molecule
Emp. Form.C15H22N2O4
Mol. Mass.294.3462
SMILESCc1ccc(cc1C)C(=O)NOCCCCCC(=O)NO