Reaction Details
TargetCyclin-dependent kinase 2
LigandBDBM50027825
Substrate/Competitorn/a
Meas. Tech.ChEMBL_936304 (CHEMBL2321002)
Ki<100±n/a nM
Citation Hole, AJBaumli, SShao, HShi, SHuang, SPepper, CFischer, PMWang, SEndicott, JANoble, ME Comparative structural and functional studies of 4-(thiazol-5-yl)-2-(phenylamino)pyrimidine-5-carbonitrile CDK9 inhibitors suggest the basis for isotype selectivity. J Med Chem56:660-70 (2013) 
 
Cyclin-dependent kinase 2
Name:Cyclin-dependent kinase 2
Type:Enzyme Subunit
Mol. Mass.:33938.17
Organism:Homo sapiens (Human)
Description:P24941
Residue:298
BDBM50027825
NameBDBM50027825
Synonyms:CHEMBL2312181
TypeSmall organic molecule
Emp. Form.C21H21NO5
Mol. Mass.367.3951
SMILESCN1CCC(C1CO)c1c(O)cc(O)c2c1oc(cc2=O)-c1ccccc1