Reaction Details
TargetPro-cathepsin H
LigandBDBM50425030
Substrate/Competitorn/a
Meas. Tech.ChEMBL_936321 (CHEMBL2321253)
Ki 129000±n/a nM
Citation Sosic, IMirkovic, BArenz, KStefane, BKos, JGobec, S Development of new cathepsin B inhibitors: combining bioisosteric replacements and structure-based design to explore the structure-activity relationships of nitroxoline derivatives. J Med Chem56:521-33 (2013) 
 
Pro-cathepsin H
Name:Pro-cathepsin H
Type:PROTEIN
Mol. Mass.:37402.31
Organism:Homo sapiens (Human)
Description:ChEMBL_1459870
Residue:335
BDBM50425030
NameBDBM50425030
Synonyms:CHEMBL2312216
TypeSmall organic molecule
Emp. Form.C12H10N4O3
Mol. Mass.258.2328
SMILESOc1c(CNCC#N)cc([N+]([O-])=O)c2cccnc12