Reaction Details
TargetNeuronal acetylcholine receptor subunit alpha-4/beta-2
LigandBDBM50425042
Substrate/Competitorn/a
Meas. Tech.ChEMBL_936598 (CHEMBL2318761)
EC50 720±n/a nM
Citation Ussing, CAHansen, CPPetersen, JGJensen, AARohde, LAAhring, PKNielsen, EŘKastrup, JSGajhede, MFrølund, BBalle, T Synthesis, pharmacology, and biostructural characterization of novela4ß2 nicotinic acetylcholine receptor agonists. J Med Chem56:940-51 (2013) 
 
Neuronal acetylcholine receptor subunit alpha-4/beta-2
Name:Neuronal acetylcholine receptor subunit alpha-4/beta-2
Type:Protein
Mol. Mass.:n/a
Description:n/a
Components:This complex has 2 components.
Component 1
Name:Neuronal acetylcholine receptor subunit alpha-4
Synonyms:ACHA4_HUMAN CHRNA4 protein Neuronal acetylcholine receptor protein alpha-4 subunit Nicotinic acetylcholine receptor alpha4/beta2/alpha5
Type:n/a
Mol. Mass.:69963.49
Organism:Homo sapiens (Human)
Description:NACHRA4
Residue:627
Component 2
Name:Neuronal acetylcholine receptor subunit beta-2
Synonyms:ACHB2_HUMAN Neuronal acetylcholine receptor protein beta-2 subunit | Nicotinic acetylcholine receptor alpha3/beta2/alpha5
Type:Protein
Mol. Mass.:57020.50
Organism:Homo sapiens (Human)
Description:P17787
Residue:502
BDBM50425042
NameBDBM50425042
Synonyms:(R)-3-(Dimethylamino)Butyl Dimethylcarbamate | CHEMBL2312568
TypeSmall organic molecule
Emp. Form.C9H20N2O2
Mol. Mass.188.2673
SMILESC[C@H](CCOC(=O)N(C)C)N(C)C