Reaction Details
TargetAcetylcholine-binding protein
LigandBDBM50425041
Substrate/Competitorn/a
Meas. Tech.ChEMBL_936605 (CHEMBL2318768)
Ki 45±n/a nM
Citation Ussing, CAHansen, CPPetersen, JGJensen, AARohde, LAAhring, PKNielsen, EŘKastrup, JSGajhede, MFrølund, BBalle, T Synthesis, pharmacology, and biostructural characterization of novela4ß2 nicotinic acetylcholine receptor agonists. J Med Chem56:940-51 (2013) 
 
Acetylcholine-binding protein
Name:Acetylcholine-binding protein
Type:n/a
Mol. Mass.:26055.52
Organism:Lymnaea stagnalis
Description:Soluble acetylcholine receptor
Residue:229
BDBM50425041
NameBDBM50425041
Synonyms:CHEMBL2312565
TypeSmall organic molecule
Emp. Form.C10H19N3O
Mol. Mass.197.2774
SMILESC[C@H](CCOc1nccn1C)N(C)C