Reaction Details
TargetAcetylcholine-binding protein
LigandBDBM50425042
Substrate/Competitorn/a
Meas. Tech.ChEMBL_936605 (CHEMBL2318768)
Ki 79±n/a nM
Citation Ussing, CAHansen, CPPetersen, JGJensen, AARohde, LAAhring, PKNielsen, EŘKastrup, JSGajhede, MFrølund, BBalle, T Synthesis, pharmacology, and biostructural characterization of novela4ß2 nicotinic acetylcholine receptor agonists. J Med Chem56:940-51 (2013) 
 
Acetylcholine-binding protein
Name:Acetylcholine-binding protein
Type:n/a
Mol. Mass.:26055.52
Organism:Lymnaea stagnalis
Description:Soluble acetylcholine receptor
Residue:229
BDBM50425042
NameBDBM50425042
Synonyms:(R)-3-(Dimethylamino)Butyl Dimethylcarbamate | CHEMBL2312568
TypeSmall organic molecule
Emp. Form.C9H20N2O2
Mol. Mass.188.2673
SMILESC[C@H](CCOC(=O)N(C)C)N(C)C