Reaction Details
TargetNeuronal acetylcholine receptor subunit alpha-7
LigandBDBM50425041
Substrate/Competitorn/a
Meas. Tech.ChEMBL_936603 (CHEMBL2318766)
Ki 1000000±n/a nM
Citation Ussing, CAHansen, CPPetersen, JGJensen, AARohde, LAAhring, PKNielsen, EŘKastrup, JSGajhede, MFrølund, BBalle, T Synthesis, pharmacology, and biostructural characterization of novela4ß2 nicotinic acetylcholine receptor agonists. J Med Chem56:940-51 (2013) 
 
Neuronal acetylcholine receptor subunit alpha-7
Name:Neuronal acetylcholine receptor subunit alpha-7
Type:Enzyme
Mol. Mass.:56502.44
Organism:Rattus norvegicus (Rat)
Description:Q05941
Residue:502
BDBM50425041
NameBDBM50425041
Synonyms:CHEMBL2312565
TypeSmall organic molecule
Emp. Form.C10H19N3O
Mol. Mass.197.2774
SMILESC[C@H](CCOc1nccn1C)N(C)C