Reaction Details
TargetNeuronal acetylcholine receptor subunit alpha-7
LigandBDBM10759
Substrate/Competitorn/a
Meas. Tech.ChEMBL_936603 (CHEMBL2318766)
Ki 170000±n/a nM
Citation Ussing, CAHansen, CPPetersen, JGJensen, AARohde, LAAhring, PKNielsen, EŘKastrup, JSGajhede, MFrølund, BBalle, T Synthesis, pharmacology, and biostructural characterization of novela4ß2 nicotinic acetylcholine receptor agonists. J Med Chem56:940-51 (2013) 
 
Neuronal acetylcholine receptor subunit alpha-7
Name:Neuronal acetylcholine receptor subunit alpha-7
Type:Enzyme
Mol. Mass.:56502.44
Organism:Rattus norvegicus (Rat)
Description:Q05941
Residue:502
BDBM10759
NameBDBM10759
Synonyms:2-acetoxyethyl(trimethyl)ammonium;bromide CHEMBL667 [2-(acetyloxy)ethyl]trimethylazanium acetylcholine chloride | cid_6060
TypeSmall Organic Molecule
Emp. Form.C7H16NO2
Mol. Mass.146.2069
SMILESCC(=O)OCC[N+](C)(C)C