Reaction Details
TargetTyrosyl-DNA phosphodiesterase 1
LigandBDBM50425085
Substrate/Competitorn/a
Meas. Tech.ChEMBL_936620 (CHEMBL2319019)
IC50 6700±n/a nM
Citation Conda-Sheridan, MReddy, PVMorrell, ACobb, BTMarchand, CAgama, KChergui, ARenaud, AStephen, AGBindu, LKPommier, YCushman, M Synthesis and biological evaluation of indenoisoquinolines that inhibit both tyrosyl-DNA phosphodiesterase I (Tdp1) and topoisomerase I (Top1). J Med Chem56:182-200 (2013) 
 
Tyrosyl-DNA phosphodiesterase 1
Name:Tyrosyl-DNA phosphodiesterase 1
Type:Enzyme
Mol. Mass.:68430.66
Organism:Homo sapiens (Human)
Description:Q9NUW8
Residue:608
BDBM50425085
NameBDBM50425085
Synonyms:CHEMBL2312908 | US9402842, 89
TypeSmall organic molecule
Emp. Form.C20H19N3O3
Mol. Mass.349.3832
SMILESCOc1ccc-2c(c1)C(=O)c1c-2n(CCCN)c(=O)c2cc(N)ccc12