Reaction Details
TargetLeukotriene A-4 hydrolase
LigandBDBM24220
Substrate/Competitorn/a
Meas. Tech.ChEMBL_936851 (CHEMBL2320733)
IC50 365±n/a nM
Citation Eccles, WBlevitt, JMBooker, JNChrovian, CCCrawford, Sde Leon, ARDeng, XFourie, AMGrice, CAHerman, KKarlsson, LKearney, AMLee-Dutra, ALiang, JLuna, RPippel, DRao, NRiley, JPSantillán, ASavall, BTanis, VMXue, XYoung, AL Identification of benzofuran central cores for the inhibition of leukotriene A(4) hydrolase. Bioorg Med Chem Lett23:811-5 (2013) 
 
Leukotriene A-4 hydrolase
Name:Leukotriene A-4 hydrolase
Type:Hydrolase; metalloprotease
Mol. Mass.:69280.41
Organism:Homo sapiens (Human)
Description:Human recombinant LTA4H.
Residue:611
BDBM24220
NameBDBM24220
Synonyms:1-(1-{2-[4-(1,3-benzothiazol-2-yloxy)phenoxy]ethyl}piperidin-4-yl)pyrrolidin-2-one | Benzthiazole compound, 11j
TypeSmall organic molecule
Emp. Form.C24H27N3O3S
Mol. Mass.437.554
SMILESO=C1CCCN1C1CCN(CCOc2ccc(Oc3nc4ccccc4s3)cc2)CC1