Reaction Details
TargetLeukotriene A-4 hydrolase
LigandBDBM50425150
Substrate/Competitorn/a
Meas. Tech.ChEMBL_936852 (CHEMBL2320734)
IC50 1120±n/a nM
Citation Eccles, WBlevitt, JMBooker, JNChrovian, CCCrawford, Sde Leon, ARDeng, XFourie, AMGrice, CAHerman, KKarlsson, LKearney, AMLee-Dutra, ALiang, JLuna, RPippel, DRao, NRiley, JPSantillán, ASavall, BTanis, VMXue, XYoung, AL Identification of benzofuran central cores for the inhibition of leukotriene A(4) hydrolase. Bioorg Med Chem Lett23:811-5 (2013) 
 
Leukotriene A-4 hydrolase
Name:Leukotriene A-4 hydrolase
Type:PROTEIN
Mol. Mass.:69048.58
Organism:Mus musculus
Description:ChEMBL_936852
Residue:611
BDBM50425150
NameBDBM50425150
Synonyms:CHEMBL2313564
TypeSmall organic molecule
Emp. Form.C20H18N2O3S
Mol. Mass.366.434
SMILESC(N1CCOCC1)c1coc2cc(Oc3nc4ccccc4s3)ccc12