Reaction Details
TargetLeukotriene A-4 hydrolase
LigandBDBM50425154
Substrate/Competitorn/a
Meas. Tech.ChEMBL_936852 (CHEMBL2320734)
IC50 420±n/a nM
Citation Eccles, WBlevitt, JMBooker, JNChrovian, CCCrawford, Sde Leon, ARDeng, XFourie, AMGrice, CAHerman, KKarlsson, LKearney, AMLee-Dutra, ALiang, JLuna, RPippel, DRao, NRiley, JPSantillán, ASavall, BTanis, VMXue, XYoung, AL Identification of benzofuran central cores for the inhibition of leukotriene A(4) hydrolase. Bioorg Med Chem Lett23:811-5 (2013) 
 
Leukotriene A-4 hydrolase
Name:Leukotriene A-4 hydrolase
Type:PROTEIN
Mol. Mass.:69048.58
Organism:Mus musculus
Description:ChEMBL_936852
Residue:611
BDBM50425154
NameBDBM50425154
Synonyms:CHEMBL2313560
TypeSmall organic molecule
Emp. Form.C21H20N2O2S
Mol. Mass.364.461
SMILESC(N1CCCCC1)c1coc2cc(Oc3nc4ccccc4s3)ccc12