Reaction Details
TargetLeukotriene A-4 hydrolase
LigandBDBM50425165
Substrate/Competitorn/a
Meas. Tech.ChEMBL_936844 (CHEMBL2320478)
IC50 34±n/a nM
Citation Eccles, WBlevitt, JMBooker, JNChrovian, CCCrawford, Sde Leon, ARDeng, XFourie, AMGrice, CAHerman, KKarlsson, LKearney, AMLee-Dutra, ALiang, JLuna, RPippel, DRao, NRiley, JPSantillán, ASavall, BTanis, VMXue, XYoung, AL Identification of benzofuran central cores for the inhibition of leukotriene A(4) hydrolase. Bioorg Med Chem Lett23:811-5 (2013) 
 
Leukotriene A-4 hydrolase
Name:Leukotriene A-4 hydrolase
Type:Hydrolase; metalloprotease
Mol. Mass.:69280.41
Organism:Homo sapiens (Human)
Description:Human recombinant LTA4H.
Residue:611
BDBM50425165
NameBDBM50425165
Synonyms:CHEMBL2313264
TypeSmall organic molecule
Emp. Form.C23H21N3O3S
Mol. Mass.419.496
SMILESCC(=O)N1C[C@@H]2C[C@H]1CN2Cc1coc2cc(Oc3nc4ccccc4s3)ccc12