Reaction Details
TargetLeukotriene A-4 hydrolase
LigandBDBM50425167
Substrate/Competitorn/a
Meas. Tech.ChEMBL_936844 (CHEMBL2320478)
IC50 7.3±n/a nM
Citation Eccles, WBlevitt, JMBooker, JNChrovian, CCCrawford, Sde Leon, ARDeng, XFourie, AMGrice, CAHerman, KKarlsson, LKearney, AMLee-Dutra, ALiang, JLuna, RPippel, DRao, NRiley, JPSantillán, ASavall, BTanis, VMXue, XYoung, AL Identification of benzofuran central cores for the inhibition of leukotriene A(4) hydrolase. Bioorg Med Chem Lett23:811-5 (2013) 
 
Leukotriene A-4 hydrolase
Name:Leukotriene A-4 hydrolase
Type:Hydrolase; metalloprotease
Mol. Mass.:69280.41
Organism:Homo sapiens (Human)
Description:Human recombinant LTA4H.
Residue:611
BDBM50425167
NameBDBM50425167
Synonyms:CHEMBL2313572
TypeSmall organic molecule
Emp. Form.C25H25N3O3S
Mol. Mass.447.549
SMILESCC(=O)N[C@@H]1C[C@@H]2CC[C@H](C1)N2Cc1coc2cc(Oc3nc4ccccc4s3)ccc12