Reaction Details
TargetLeukotriene A-4 hydrolase
LigandBDBM50425160
Substrate/Competitorn/a
Meas. Tech.ChEMBL_936852 (CHEMBL2320734)
IC50 210±n/a nM
Citation Eccles, WBlevitt, JMBooker, JNChrovian, CCCrawford, Sde Leon, ARDeng, XFourie, AMGrice, CAHerman, KKarlsson, LKearney, AMLee-Dutra, ALiang, JLuna, RPippel, DRao, NRiley, JPSantillán, ASavall, BTanis, VMXue, XYoung, AL Identification of benzofuran central cores for the inhibition of leukotriene A(4) hydrolase. Bioorg Med Chem Lett23:811-5 (2013) 
 
Leukotriene A-4 hydrolase
Name:Leukotriene A-4 hydrolase
Type:PROTEIN
Mol. Mass.:69048.58
Organism:Mus musculus
Description:ChEMBL_936852
Residue:611
BDBM50425160
NameBDBM50425160
Synonyms:CHEMBL2313269
TypeSmall organic molecule
Emp. Form.C22H20N4O3S
Mol. Mass.420.484
SMILESCC(=O)N1CC2CC1CN2Cc1cc2ccc(Oc3nc4ncccc4s3)cc2o1