Reaction Details
TargetCytochrome P450 2C9
LigandBDBM60989
Substrate/Competitorn/a
Meas. Tech.ChEMBL_936865 (CHEMBL2320747)
IC50 8200±n/a nM
Citation Sy-Cordero, AAGraf, TNRunyon, SPWani, MCKroll, DJAgarwal, RBrantley, SJPaine, MFPolyak, SJOberlies, NH Enhanced bioactivity of silybin B methylation products. Bioorg Med Chem21:742-7 (2013) 
 
Cytochrome P450 2C9
Name:Cytochrome P450 2C9
Type:Enzyme
Mol. Mass.:55636.33
Organism:Homo sapiens (Human)
Description:P11712
Residue:490
BDBM60989
NameBDBM60989
Synonyms:(3S)-2-[(2S,3S)-2-(hydroxymethyl)-3-(3-methoxy-4-oxidanyl-phenyl)-2,3-dihydro-1,4-benzodioxin-6-yl]-3,5,7-tris(oxidanyl)-2,3-dihydrochromen-4-one (3S)-3,5,7-trihydroxy-2-[(2S,3S)-3-(4-hydroxy-3-methoxyphenyl)-2-(hydroxymethyl)-2,3-dihydro-1,4-benzodioxin-6-yl]-2,3-dihydrochromen-4-one MLS001332411 Silibinin | cid_16211710
TypeSmall organic molecule
Emp. Form.C25H22O10
Mol. Mass.482.4362
SMILESCOc1cc(ccc1O)[C@@H]1Oc2cc(ccc2O[C@H]1CO)C1Oc2cc(O)cc(O)c2C(O)C1=O