Reaction Details
TargetPancreatic alpha-amylase
LigandBDBM50425179
Substrate/Competitorn/a
Meas. Tech.ChEMBL_936874 (CHEMBL2320756)
IC50 20330±n/a nM
Citation Patil, VSNandre, KPGhosh, SRao, VJChopade, BASridhar, BBhosale, SVBhosale, SV Synthesis, crystal structure and antidiabetic activity of substituted (E)-3-(Benzo [d]thiazol-2-ylamino) phenylprop-2-en-1-one. Eur J Med Chem59:304-9 (2013) 
 
Pancreatic alpha-amylase
Name:Pancreatic alpha-amylase
Type:Protein
Mol. Mass.:57088.07
Organism:Sus scrofa (Pig)
Description:P00690
Residue:511
BDBM50425179
NameBDBM50425179
Synonyms:CHEMBL2313587
TypeSmall organic molecule
Emp. Form.C17H13ClN2OS2
Mol. Mass.360.881
SMILESCSC(CC(=O)c1ccc(Cl)cc1)=Nc1nc2ccccc2s1