Reaction Details
TargetMelatonin receptor type 1B
LigandBDBM50425202
Substrate/Competitorn/a
Meas. Tech.ChEMBL_937789 (CHEMBL2318043)
Ki 0.070000±n/a nM
Citation Morellato, LLefas-Le Gall, MLanglois, MCaignard, DHRenard, PDelagrange, PMathé-Allainmat, M Synthesis of new N-(arylcyclopropyl)acetamides and N-(arylvinyl)acetamides as conformationally-restricted ligands for melatonin receptors. Bioorg Med Chem Lett23:430-4 (2012) 
 
Melatonin receptor type 1B
Name:Melatonin receptor type 1B
Type:Enzyme
Mol. Mass.:40203.54
Organism:Homo sapiens (Human)
Description:P49286
Residue:362
BDBM50425202
NameBDBM50425202
Synonyms:CHEMBL2314259
TypeSmall organic molecule
Emp. Form.C16H17NO3
Mol. Mass.271.3111
SMILESCOc1ccc2ccc(OC)c(\C=C\NC(C)=O)c2c1