Reaction Details
TargetProstaglandin G/H synthase 2
LigandBDBM50425313
Substrate/Competitorn/a
Meas. Tech.ChEMBL_933826 (CHEMBL2321380)
IC50>30000±n/a nM
Citation Kablaoui, NPatel, SShao, JDemian, DHoffmaster, KBerlioz, FVazquez, MLMoore, WMNugent, RA Novel benzoxazole inhibitors of mPGES-1. Bioorg Med Chem Lett23:907-11 (2013) 
 
Prostaglandin G/H synthase 2
Name:Prostaglandin G/H synthase 2
Type:Enzyme Catalytic Domain
Mol. Mass.:69173.51
Organism:RAT
Description:COX-2 0 RAT::P35355
Residue:604
BDBM50425313
NameBDBM50425313
Synonyms:CHEMBL2315853
TypeSmall organic molecule
Emp. Form.C25H28ClN3O3
Mol. Mass.453.961
SMILESClc1ccc2oc(nc2c1)N1CCC(CC1)C(=O)N[C@H]1CCC[C@@H]1OCc1ccccc1