Reaction Details
TargetProstaglandin G/H synthase 2
LigandBDBM50425313
Substrate/Competitorn/a
Meas. Tech.ChEMBL_933841 (CHEMBL2321395)
IC50 7560±n/a nM
Citation Kablaoui, NPatel, SShao, JDemian, DHoffmaster, KBerlioz, FVazquez, MLMoore, WMNugent, RA Novel benzoxazole inhibitors of mPGES-1. Bioorg Med Chem Lett23:907-11 (2013) 
 
Prostaglandin G/H synthase 2
Name:Prostaglandin G/H synthase 2
Type:Enzyme
Mol. Mass.:69003.89
Organism:Homo sapiens (Human)
Description:Recombinant Cox-2 provided by Cayman (Cayman Chemical Co.,Ann Arbor, MI).
Residue:604
BDBM50425313
NameBDBM50425313
Synonyms:CHEMBL2315853
TypeSmall organic molecule
Emp. Form.C25H28ClN3O3
Mol. Mass.453.961
SMILESClc1ccc2oc(nc2c1)N1CCC(CC1)C(=O)N[C@H]1CCC[C@@H]1OCc1ccccc1