Reaction Details
TargetProstaglandin G/H synthase 2
LigandBDBM50425318
Substrate/Competitorn/a
Meas. Tech.ChEMBL_933841 (CHEMBL2321395)
IC50 11100±n/a nM
Citation Kablaoui, NPatel, SShao, JDemian, DHoffmaster, KBerlioz, FVazquez, MLMoore, WMNugent, RA Novel benzoxazole inhibitors of mPGES-1. Bioorg Med Chem Lett23:907-11 (2013) 
 
Prostaglandin G/H synthase 2
Name:Prostaglandin G/H synthase 2
Type:Enzyme
Mol. Mass.:69003.89
Organism:Homo sapiens (Human)
Description:Recombinant Cox-2 provided by Cayman (Cayman Chemical Co.,Ann Arbor, MI).
Residue:604
BDBM50425318
NameBDBM50425318
Synonyms:CHEMBL2315861
TypeSmall organic molecule
Emp. Form.C20H26ClN3O3
Mol. Mass.391.892
SMILESOC[C@H]1CC[C@H](CC1)NC(=O)C1CCN(CC1)c1nc2cc(Cl)ccc2o1