Reaction Details
TargetProstaglandin G/H synthase 2
LigandBDBM50425314
Substrate/Competitorn/a
Meas. Tech.ChEMBL_933842 (CHEMBL2321396)
IC50 1010±n/a nM
Citation Kablaoui, NPatel, SShao, JDemian, DHoffmaster, KBerlioz, FVazquez, MLMoore, WMNugent, RA Novel benzoxazole inhibitors of mPGES-1. Bioorg Med Chem Lett23:907-11 (2013) 
 
Prostaglandin G/H synthase 2
Name:Prostaglandin G/H synthase 2
Type:Enzyme
Mol. Mass.:69003.89
Organism:Homo sapiens (Human)
Description:Recombinant Cox-2 provided by Cayman (Cayman Chemical Co.,Ann Arbor, MI).
Residue:604
BDBM50425314
NameBDBM50425314
Synonyms:CHEMBL2315877
TypeSmall organic molecule
Emp. Form.C18H22ClN3O2
Mol. Mass.347.839
SMILESClc1ccc2oc(nc2c1)N1CCC(CC1)C(=O)NC1CCCC1