Reaction Details
TargetProstaglandin E synthase
LigandBDBM50425320
Substrate/Competitorn/a
Meas. Tech.ChEMBL_933843 (CHEMBL2321397)
IC50 43±n/a nM
Citation Kablaoui, NPatel, SShao, JDemian, DHoffmaster, KBerlioz, FVazquez, MLMoore, WMNugent, RA Novel benzoxazole inhibitors of mPGES-1. Bioorg Med Chem Lett23:907-11 (2013) 
 
Prostaglandin E synthase
Name:Prostaglandin E synthase
Type:Protein
Mol. Mass.:17112.22
Organism:Homo sapiens (Human)
Description:n/a
Residue:152
BDBM50425320
NameBDBM50425320
Synonyms:CHEMBL2315857
TypeSmall organic molecule
Emp. Form.C25H28ClN3O3
Mol. Mass.453.961
SMILESClc1ccc2oc(nc2c1)N1CCC(CC1)C(=O)N[C@@H]1CCC[C@@H]1COc1ccccc1