Reaction Details
TargetMitogen-activated protein kinase 14
LigandBDBM50425343
Substrate/Competitorn/a
Meas. Tech.ChEMBL_933871 (CHEMBL2317232)
IC50 3.0±n/a nM
Citation Fischer, SWentsch, HKMayer-Wrangowski, SCZimmermann, MBauer, SMStorch, KNiess, RKoeberle, SCGrütter, CBoeckler, FMRauh, DLaufer, SA Dibenzosuberones as p38 mitogen-activated protein kinase inhibitors with low ATP competitiveness and outstanding whole blood activity. J Med Chem56:241-53 (2013) 
 
Mitogen-activated protein kinase 14
Name:Mitogen-activated protein kinase 14
Type:Serine/threonine-protein kinase
Mol. Mass.:41286.76
Organism:Homo sapiens (Human)
Description:Q16539
Residue:360
BDBM50425343
NameBDBM50425343
Synonyms:CHEMBL2316470
TypeSmall organic molecule
Emp. Form.C23H18F2N2O2
Mol. Mass.392.398
SMILESCNC(=O)c1ccc2CCc3cc(Nc4ccc(F)cc4F)ccc3C(=O)c2c1