Reaction Details
TargetMitogen-activated protein kinase 14
LigandBDBM50425353
Substrate/Competitorn/a
Meas. Tech.ChEMBL_933871 (CHEMBL2317232)
IC50 1.000000±n/a nM
Citation Fischer, SWentsch, HKMayer-Wrangowski, SCZimmermann, MBauer, SMStorch, KNiess, RKoeberle, SCGrütter, CBoeckler, FMRauh, DLaufer, SA Dibenzosuberones as p38 mitogen-activated protein kinase inhibitors with low ATP competitiveness and outstanding whole blood activity. J Med Chem56:241-53 (2013) 
 
Mitogen-activated protein kinase 14
Name:Mitogen-activated protein kinase 14
Type:Serine/threonine-protein kinase
Mol. Mass.:41286.76
Organism:Homo sapiens (Human)
Description:Q16539
Residue:360
BDBM50425353
NameBDBM50425353
Synonyms:CHEMBL2316206
TypeSmall organic molecule
Emp. Form.C28H26F2N2O4
Mol. Mass.492.5138
SMILESFc1ccc(Nc2ccc3c(CCc4ccc(cc4C3=O)C(=O)OCCN3CCOCC3)c2)c(F)c1