Reaction Details
TargetMitogen-activated protein kinase 14
LigandBDBM50425352
Substrate/Competitorn/a
Meas. Tech.ChEMBL_933871 (CHEMBL2317232)
IC50 1.000000±n/a nM
Citation Fischer, SWentsch, HKMayer-Wrangowski, SCZimmermann, MBauer, SMStorch, KNiess, RKoeberle, SCGrütter, CBoeckler, FMRauh, DLaufer, SA Dibenzosuberones as p38 mitogen-activated protein kinase inhibitors with low ATP competitiveness and outstanding whole blood activity. J Med Chem56:241-53 (2013) 
 
Mitogen-activated protein kinase 14
Name:Mitogen-activated protein kinase 14
Type:Serine/threonine-protein kinase
Mol. Mass.:41286.76
Organism:Homo sapiens (Human)
Description:Q16539
Residue:360
BDBM50425352
NameBDBM50425352
Synonyms:CHEMBL2316486
TypeSmall organic molecule
Emp. Form.C31H27FN2O5
Mol. Mass.526.5549
SMILESOC[C@H](O)COc1ccc2CCc3cc(Nc4ccc(F)c(NC(=O)c5ccccc5)c4)ccc3C(=O)c2c1