Reaction Details
TargetMitogen-activated protein kinase 14
LigandBDBM50425369
Substrate/Competitorn/a
Meas. Tech.ChEMBL_933871 (CHEMBL2317232)
IC50 4.0±n/a nM
Citation Fischer, SWentsch, HKMayer-Wrangowski, SCZimmermann, MBauer, SMStorch, KNiess, RKoeberle, SCGrütter, CBoeckler, FMRauh, DLaufer, SA Dibenzosuberones as p38 mitogen-activated protein kinase inhibitors with low ATP competitiveness and outstanding whole blood activity. J Med Chem56:241-53 (2013) 
 
Mitogen-activated protein kinase 14
Name:Mitogen-activated protein kinase 14
Type:Serine/threonine-protein kinase
Mol. Mass.:41286.76
Organism:Homo sapiens (Human)
Description:Q16539
Residue:360
BDBM50425369
NameBDBM50425369
Synonyms:CHEMBL2316208
TypeSmall organic molecule
Emp. Form.C28H20F2N2O2
Mol. Mass.454.4674
SMILESFc1cc(F)c(Nc2ccc3c(CCc4ccccc4C3=O)c2)cc1NC(=O)c1ccccc1